develooper Front page | perl.daily-build.reports | Postings from July 2022

Smoke [blead] v5.37.1-85-g31c1155d19 FAIL(F) openbsd 7.0 (sparc64/16cpu)

From:
OpenBSD stable sparc64 Perl Smoker
Date:
July 8, 2022 03:23
Subject:
Smoke [blead] v5.37.1-85-g31c1155d19 FAIL(F) openbsd 7.0 (sparc64/16cpu)
Message ID:
<577f491e1b4a4709@perl-sparc64-stable.home.hewus.com> 37ABEBAE-FE6D-11EC-8408-CB998F0A682E-26700269!pb-smtp2.pobox.com
Automated smoke report for branch blead 5.37.2 patch 31c1155d19a27dd4a29c30ff34ab892b82131746 v5.37.1-85-g31c1155d19
perl-sparc64-stable.home.hewus.com: SPARC-T4 (rev 0.0) @ 2847.862 MHz (2847 MHz) (sparc64/16 cpu)
    on        openbsd - 7.0
    using     cc version 4.2.1 20070719
    smoketime 1 day 15 hours 2 minutes (average 4 hours 52 minutes)

Summary: FAIL(F)

O = OK  F = Failure(s), extended report at the bottom
X = Failure(s) under TEST but not under harness
? = still running or test results not (yet) available
Build failures during:       - = unknown or N/A
c = Configure, m = make, M = make (after miniperl), t = make test-prep

v5.37.1-85-g31c1155d19  Configuration (common) none
----------- ---------------------------------------------------------
F F F F F F 
F F F F F F -Duseithreads
F F F F F F -Acppflags=-DBIG_TIME -DNO_LOCALE_NUMERIC -DNO_LOCALE_COLLATE
F F F F F F -Acppflags=-DBIG_TIME -DNO_LOCALE_NUMERIC -DNO_LOCALE_COLLATE -Duseithreads
| | | | | +- LC_ALL = UTF-8 -DDEBUGGING
| | | | +--- PERLIO = perlio -DDEBUGGING
| | | +----- PERLIO = stdio  -DDEBUGGING
| | +------- LC_ALL = UTF-8
| +--------- PERLIO = perlio
+----------- PERLIO = stdio 

Tests skipped on user request:
    # One test name on a line
Failures: (common-args) none
[stdio/perlio/UTF-8] 
[stdio/perlio/UTF-8] -DDEBUGGING
[stdio/perlio/UTF-8] -Duseithreads
[stdio/perlio/UTF-8] -DDEBUGGING -Duseithreads
[stdio/perlio/UTF-8] -Acppflags=-DBIG_TIME -DNO_LOCALE_NUMERIC -DNO_LOCALE_COLLATE
[perlio/UTF-8] -DDEBUGGING -Acppflags=-DBIG_TIME -DNO_LOCALE_NUMERIC -DNO_LOCALE_COLLATE
[stdio/perlio/UTF-8] -Acppflags=-DBIG_TIME -DNO_LOCALE_NUMERIC -DNO_LOCALE_COLLATE -Duseithreads
[stdio/perlio/UTF-8] -DDEBUGGING -Acppflags=-DBIG_TIME -DNO_LOCALE_NUMERIC -DNO_LOCALE_COLLATE -Duseithreads
    ../t/re/reg_mesg.t..........................................FAILED
        No plan found in TAP output
    ../t/re/regex_sets.t........................................FAILED
        No plan found in TAP output

[stdio] -DDEBUGGING -Acppflags=-DBIG_TIME -DNO_LOCALE_NUMERIC -DNO_LOCALE_COLLATE
    ../t/re/reg_mesg.t..........................................FAILED
        No plan found in TAP output
    ../t/re/regex_sets.t........................................FAILED
        No plan found in TAP output
Inconsistent test results (between TEST and harness):
    ../lib/warnings.t....................... ..................................................... FAILED at test 828

MANIFEST did not declare '.mailmap'

Compiler messages(gcc):


Non-Fatal messages(gcc):



-- 
Report by Test::Smoke v1.78 running on perl 5.32.1
(Reporter v0.054 / Smoker v0.046)



nntp.perl.org: Perl Programming lists via nntp and http.
Comments to Ask Bjørn Hansen at ask@perl.org | Group listing | About