develooper Front page | perl.daily-build.reports | Postings from August 2022

Smoke [blead] v5.37.2-143-gea9a38e2d3 FAIL(F) linux 5.15.59-0-lts[Alpine Linux v3.15 3.15.5] (x86_64/1 cpu)

From:
Carlos Guevara
Date:
August 10, 2022 14:51
Subject:
Smoke [blead] v5.37.2-143-gea9a38e2d3 FAIL(F) linux 5.15.59-0-lts[Alpine Linux v3.15 3.15.5] (x86_64/1 cpu)
Message ID:
20220810144826.6A62519F337@cjg-alpine3
Automated smoke report for branch blead 5.37.3 patch ea9a38e2d3f82f51bc1f6e2fec85911572064a81 v5.37.2-143-gea9a38e2d3
cjg-alpine3: Intel(R) Xeon(R) CPU E5-2620 v2 @ 2.10GHz (GenuineIntel 2111MHz) (x86_64/1 cpu)
    on        linux - 5.15.59-0-lts [Alpine Linux v3.15 3.15.5]
    using     gcc version 10.3.1 20211027
    smoketime 7 hours 58 minutes (average 39 minutes 52 seconds)

Summary: FAIL(F)

O = OK  F = Failure(s), extended report at the bottom
X = Failure(s) under TEST but not under harness
? = still running or test results not (yet) available
Build failures during:       - = unknown or N/A
c = Configure, m = make, M = make (after miniperl), t = make test-prep

v5.37.2-143-gea9a38e2d3  Configuration (common) -Dcc=gcc
----------- ---------------------------------------------------------
O O         
O O         -Duse64bitall
O O         -Duselongdouble
F F         -Duseithreads
F F         -Duseithreads -Duse64bitall
F F         -Duseithreads -Duselongdouble
| +--------- -DDEBUGGING
+----------- no debugging


Testsuite was run only with 'harness'

Tests skipped on user request:
    # One test name on a line
Failures: (common-args) -Dcc=gcc
[default] -Duseithreads
[default] -DDEBUGGING -Duseithreads
[default] -Duseithreads -Duse64bitall
[default] -DDEBUGGING -Duseithreads -Duse64bitall
[default] -Duseithreads -Duselongdouble
[default] -DDEBUGGING -Duseithreads -Duselongdouble
../t/re/subst.t.............................................FAILED
    263
../t/re/subst_wamp.t........................................FAILED
    263
../t/re/substT.t............................................FAILED
    263
../t/op/getpid.t............................................FAILED
    Non-zero exit status: 29
    No plan found in TAP output
../t/op/reset.t.............................................FAILED
    37-40
../t/op/threads-dirh.t......................................FAILED
    Non-zero exit status: 29
    Bad plan.  You planned 6 tests but ran 0.
../t/op/threads.t...........................................FAILED
    29
../t/uni/fold.t.............................................FAILED
    18676-18677, 18844-18845
../cpan/Scalar-List-Utils/t/dualvar.t.......................FAILED
    Non-zero exit status: 29
    Bad plan.  You planned 41 tests but ran 0.
../dist/Thread-Queue/t/01_basic.t...........................FAILED
    Non-zero exit status: 29
    No plan found in TAP output
../dist/Thread-Queue/t/02_refs.t............................FAILED
    Non-zero exit status: 29
    No plan found in TAP output
../dist/Thread-Queue/t/03_peek.t............................FAILED
    Non-zero exit status: 29
    No plan found in TAP output
../dist/Thread-Queue/t/05_extract.t.........................FAILED
    Non-zero exit status: 29
    No plan found in TAP output
../dist/Thread-Queue/t/06_insert.t..........................FAILED
    Non-zero exit status: 29
    No plan found in TAP output
../dist/Thread-Queue/t/07_lock.t............................FAILED
    Non-zero exit status: 29
    No plan found in TAP output
../dist/Thread-Queue/t/09_ended.t...........................FAILED
    Non-zero exit status: 29
    No plan found in TAP output
../dist/Thread-Queue/t/10_timed.t...........................FAILED
    Non-zero exit status: 29
    No plan found in TAP output
../dist/Thread-Queue/t/11_limit.t...........................FAILED
    Non-zero exit status: 29
    No plan found in TAP output
../dist/Thread-Semaphore/t/01_basic.t.......................FAILED
    Non-zero exit status: 29
    No plan found in TAP output
../dist/Thread-Semaphore/t/04_nonblocking.t.................FAILED
    Non-zero exit status: 29
    No plan found in TAP output
../dist/Thread-Semaphore/t/05_force.t.......................FAILED
    Non-zero exit status: 29
    No plan found in TAP output
../dist/Thread-Semaphore/t/06_timed.t.......................FAILED
    Non-zero exit status: 29
    No plan found in TAP output
../dist/threads-shared/t/av_refs.t..........................FAILED
    Non-zero exit status: 29
    Bad plan.  You planned 14 tests but ran 0.
../dist/threads-shared/t/av_simple.t........................FAILED
    Non-zero exit status: 29
    Bad plan.  You planned 47 tests but ran 0.
../dist/threads-shared/t/blessed.t..........................FAILED
    Non-zero exit status: 29
    Bad plan.  You planned 37 tests but ran 0.
../dist/threads-shared/t/clone.t............................FAILED
    Non-zero exit status: 29
    Bad plan.  You planned 40 tests but ran 0.
../dist/threads-shared/t/cond.t.............................FAILED
    Non-zero exit status: 29
    Bad plan.  You planned 32 tests but ran 0.
../dist/threads-shared/t/dualvar.t..........................FAILED
    Non-zero exit status: 29
    Bad plan.  You planned 226 tests but ran 0.
../dist/threads-shared/t/hv_refs.t..........................FAILED
    Non-zero exit status: 29
    Bad plan.  You planned 20 tests but ran 0.
../dist/threads-shared/t/hv_simple.t........................FAILED
    Non-zero exit status: 29
    Bad plan.  You planned 16 tests but ran 0.
../dist/threads-shared/t/object.t...........................FAILED
    Non-zero exit status: 29
    Bad plan.  You planned 28 tests but ran 0.
../dist/threads-shared/t/object2.t..........................FAILED
    Non-zero exit status: 29
    Bad plan.  You planned 133 tests but ran 0.
../dist/threads-shared/t/shared_attr.t......................FAILED
    Non-zero exit status: 29
    Bad plan.  You planned 101 tests but ran 0.
../dist/threads-shared/t/stress.t...........................FAILED
    Non-zero exit status: 29
    Bad plan.  You planned 1 tests but ran 0.
../dist/threads-shared/t/sv_refs.t..........................FAILED
    Non-zero exit status: 29
    Bad plan.  You planned 21 tests but ran 0.
../dist/threads-shared/t/sv_simple.t........................FAILED
    Non-zero exit status: 29
    Bad plan.  You planned 11 tests but ran 0.
../dist/threads-shared/t/utf8.t.............................FAILED
    Non-zero exit status: 29
    Bad plan.  You planned 12 tests but ran 0.
../dist/threads-shared/t/wait.t.............................FAILED
    Non-zero exit status: 29
    Bad plan.  You planned 91 tests but ran 0.
../dist/threads-shared/t/waithires.t........................FAILED
    Non-zero exit status: 29
    Bad plan.  You planned 63 tests but ran 0.
../dist/threads/t/blocks.t..................................FAILED
    Non-zero exit status: 29
    No plan found in TAP output
../dist/threads/t/context.t.................................FAILED
    Non-zero exit status: 29
    No plan found in TAP output
../dist/threads/t/end.t.....................................FAILED
    Non-zero exit status: 29
    No plan found in TAP output
../dist/threads/t/exit.t....................................FAILED
    Non-zero exit status: 29
    No plan found in TAP output
../dist/threads/t/free.t....................................FAILED
    Non-zero exit status: 29
    No plan found in TAP output
../dist/threads/t/free2.t...................................FAILED
    Non-zero exit status: 29
    No plan found in TAP output
../dist/threads/t/join.t....................................FAILED
    Non-zero exit status: 29
    No plan found in TAP output
../dist/threads/t/kill.t....................................FAILED
    Non-zero exit status: 29
    No plan found in TAP output
../dist/threads/t/kill2.t...................................FAILED
    Non-zero exit status: 29
    No plan found in TAP output
../dist/threads/t/kill3.t...................................FAILED
    Non-zero exit status: 29
    No plan found in TAP output
../dist/threads/t/problems.t................................FAILED
    Non-zero exit status: 29
    No plan found in TAP output
../dist/threads/t/state.t...................................FAILED
    Non-zero exit status: 29
    No plan found in TAP output
../dist/threads/t/thread.t..................................FAILED
    Non-zero exit status: 29
    No plan found in TAP output
../ext/XS-APItest/t/boolean-thr.t...........................FAILED
    Non-zero exit status: 29
    No plan found in TAP output
../lib/perl5db.t............................................FAILED
    14
../lib/Thread.t.............................................FAILED
    Non-zero exit status: 29
    No plan found in TAP output

MANIFEST did not declare '.mailmap'

Compiler messages(gcc):


Non-Fatal messages(gcc):



-- 
Report by Test::Smoke v1.71 running on perl 5.30.2
(Reporter v0.053 / Smoker v0.046)



nntp.perl.org: Perl Programming lists via nntp and http.
Comments to Ask Bjørn Hansen at ask@perl.org | Group listing | About