develooper Front page | perl.daily-build.reports | Postings from August 2022

Smoke [smoke-me/khw-locale4] v5.37.2-224-g41d4f6ca07 PASS netbsd 9.2(amd64/1 cpu)

Thread Previous
From:
Carlos Guevara
Date:
August 16, 2022 08:46
Subject:
Smoke [smoke-me/khw-locale4] v5.37.2-224-g41d4f6ca07 PASS netbsd 9.2(amd64/1 cpu)
Message ID:
20220816084539.766F11222C6@cjg-netbsd9
Automated smoke report for branch smoke-me/khw-locale4 5.37.3 patch 41d4f6ca0715b28610cbca683f92f02368c60fa6 v5.37.2-224-g41d4f6ca07
cjg-netbsd9: Intel 686-class (amd64/1 cpu)
    on        netbsd - 9.2
    using     gcc version 7.5.0
    smoketime 5 hours 21 minutes (average 40 minutes 13 seconds)

Summary: PASS

O = OK  F = Failure(s), extended report at the bottom
X = Failure(s) under TEST but not under harness
? = still running or test results not (yet) available
Build failures during:       - = unknown or N/A
c = Configure, m = make, M = make (after miniperl), t = make test-prep

v5.37.2-224-g41d4f6ca07  Configuration (common) -Dcc=gcc
----------- ---------------------------------------------------------
O O         
O O         -Duse64bitall
O O         -Duseithreads
O O         -Duseithreads -Duse64bitall
| +--------- -DDEBUGGING
+----------- no debugging


Testsuite was run only with 'harness'

Tests skipped on user request:
    # One test name on a line
MANIFEST did not declare '.mailmap'

Compiler messages(gcc):
locale.c:146:19: warning: 'C_codeset' defined but not used [-Wunused-const-variable=]
/usr/include/sys/cdefs_elf.h:67:20: error: missing binary operator before token "("
/usr/include/sys/cdefs_elf.h:73:20: error: missing binary operator before token "("
/usr/include/sys/cdefs_elf.h:79:20: error: missing binary operator before token "("
Socket.c: In function 'XS_Socket_pack_ip_mreq_source':
Socket.c:1709:7: warning: variable 'interface' set but not used [-Wunused-but-set-variable]
const-c.inc: In function 'constant_19':
const-c.inc:351:42: warning: unused parameter 'iv_return' [-Wunused-parameter]
Piece.xs: In function '_strptime':
Piece.xs:719:8: warning: 'len' may be used uninitialized in this function [-Wmaybe-uninitialized]
locale.c: In function 'S_my_langinfo_i':
locale.c:3851:28: warning: format '%d' expects argument of type 'int', but argument 3 has type 'nl_item {aka const long int}' [-Wformat=]
perl.h:4943:33: note: in definition of macro 'DEBUG__'
locale.c:3850:5: note: in expansion of macro 'DEBUG_Lv'

Non-Fatal messages(gcc):



-- 
Report by Test::Smoke v1.71 running on perl 5.30.2
(Reporter v0.053 / Smoker v0.046)

Thread Previous


nntp.perl.org: Perl Programming lists via nntp and http.
Comments to Ask Bjørn Hansen at ask@perl.org | Group listing | About