develooper Front page | perl.daily-build.reports | Postings from August 2022

Smoke [blead] v5.37.2-323-gbded974f30 FAIL(F) netbsd 8.2 (amd64/1cpu)

Carlos Guevara
August 23, 2022 05:38
Smoke [blead] v5.37.2-323-gbded974f30 FAIL(F) netbsd 8.2 (amd64/1cpu)
Message ID:
Automated smoke report for branch blead 5.37.4 patch bded974f30650c2002b7abfdf8555531ecbfac81 v5.37.2-323-gbded974f30
cjg-netbsd8: Intel 686-class (amd64/1 cpu)
    on        netbsd - 8.2
    using     gcc version 5.5.0
    smoketime 5 hours 37 minutes (average 42 minutes 9 seconds)

Summary: FAIL(F)

O = OK  F = Failure(s), extended report at the bottom
X = Failure(s) under TEST but not under harness
? = still running or test results not (yet) available
Build failures during:       - = unknown or N/A
c = Configure, m = make, M = make (after miniperl), t = make test-prep

v5.37.2-323-gbded974f30  Configuration (common) -Dcc=gcc
----------- ---------------------------------------------------------
F F         
F F         -Duse64bitall
F F         -Duseithreads
F F         -Duseithreads -Duse64bitall
| +--------- -DDEBUGGING
+----------- no debugging

Testsuite was run only with 'harness'

Tests skipped on user request:
    # One test name on a line
Failures: (common-args) -Dcc=gcc
[default] -DDEBUGGING
[default] -Duse64bitall
[default] -DDEBUGGING -Duse64bitall
[default] -Duseithreads
[default] -DDEBUGGING -Duseithreads
[default] -Duseithreads -Duse64bitall
[default] -DDEBUGGING -Duseithreads -Duse64bitall
    Non-zero exit status: 3

MANIFEST did not declare '.mailmap'

Compiler messages(gcc):
/usr/include/sys/cdefs_elf.h:67:20: error: missing binary operator before token "("
/usr/include/sys/cdefs_elf.h:73:20: error: missing binary operator before token "("
/usr/include/sys/cdefs_elf.h:79:20: error: missing binary operator before token "("
Socket.c: In function 'XS_Socket_pack_ip_mreq_source':
Socket.c:1710:7: warning: variable 'interface' set but not used [-Wunused-but-set-variable] In function 'constant_19': warning: unused parameter 'iv_return' [-Wunused-parameter]
util.c: In function 'Perl_xs_handshake':
util.c:5795:36: warning: comparison is always true due to limited range of data type [-Wtype-limits]
locale.c: In function 'S_my_langinfo_i':
locale.c:3830:28: warning: format '%d' expects argument of type 'int', but argument 3 has type 'nl_item {aka const long int}' [-Wformat=]
perl.h:4960:33: note: in definition of macro 'DEBUG__'
locale.c:3829:5: note: in expansion of macro 'DEBUG_Lv'

Non-Fatal messages(gcc):

Report by Test::Smoke v1.71 running on perl 5.26.1
(Reporter v0.053 / Smoker v0.046) Perl Programming lists via nntp and http.
Comments to Ask Bjørn Hansen at | Group listing | About