develooper Front page | perl.daily-build.reports | Postings from October 2022

Smoke [smoke-me/khw-handy_locale] v5.37.4-92-g4f280e64b1 PASS netbsd8.2 (amd64/1 cpu)

Thread Next
Carlos Guevara
October 12, 2022 11:27
Smoke [smoke-me/khw-handy_locale] v5.37.4-92-g4f280e64b1 PASS netbsd8.2 (amd64/1 cpu)
Message ID:
Automated smoke report for branch smoke-me/khw-handy_locale 5.37.5 patch 4f280e64b1f91b4dd186a58321a274b5b7161205 v5.37.4-92-g4f280e64b1
cjg-netbsd8: Intel 686-class (amd64/1 cpu)
    on        netbsd - 8.2
    using     gcc version 5.5.0
    smoketime 5 hours 43 minutes (average 42 minutes 57 seconds)

Summary: PASS

O = OK  F = Failure(s), extended report at the bottom
X = Failure(s) under TEST but not under harness
? = still running or test results not (yet) available
Build failures during:       - = unknown or N/A
c = Configure, m = make, M = make (after miniperl), t = make test-prep

v5.37.4-92-g4f280e64b1  Configuration (common) -Dcc=gcc
----------- ---------------------------------------------------------
O O         
O O         -Duse64bitall
O O         -Duseithreads
O O         -Duseithreads -Duse64bitall
| +--------- -DDEBUGGING
+----------- no debugging

Testsuite was run only with 'harness'

Tests skipped on user request:
    # One test name on a line
MANIFEST did not declare '.mailmap'

Compiler messages(gcc):
locale.c:5961:1: warning: 'S_get_displayable_string' defined but not used [-Wunused-function]
/usr/include/sys/cdefs_elf.h:67:20: error: missing binary operator before token "("
/usr/include/sys/cdefs_elf.h:73:20: error: missing binary operator before token "("
/usr/include/sys/cdefs_elf.h:79:20: error: missing binary operator before token "("
Socket.c: In function 'XS_Socket_pack_ip_mreq_source':
Socket.c:1710:7: warning: variable 'interface' set but not used [-Wunused-but-set-variable] In function 'constant_19': warning: unused parameter 'iv_return' [-Wunused-parameter]
util.c: In function 'Perl_xs_handshake':
util.c:5802:36: warning: comparison is always true due to limited range of data type [-Wtype-limits]
locale.c: In function 'S_my_langinfo_i':
locale.c:3912:28: warning: format '%d' expects argument of type 'int', but argument 3 has type 'nl_item {aka const long int}' [-Wformat=]
perl.h:4916:33: note: in definition of macro 'DEBUG__'
locale.c:3911:5: note: in expansion of macro 'DEBUG_Lv'

Non-Fatal messages(gcc):

Report by Test::Smoke v1.71 running on perl 5.26.1
(Reporter v0.053 / Smoker v0.046)

Thread Next Perl Programming lists via nntp and http.
Comments to Ask Bjørn Hansen at | Group listing | About