Front page | perl.daily-build.reports |
Postings from March 2023
Smoke [blead] v5.37.9-23-gffdab987e6 FAIL(F) linux5.18.18-200.fc36.x86_64 [Fedora Linux 37] (x86_64/1 cpu[8 cores]){blead_clang_quick_sanitize=undefined}
From:
George Greer
Date:
March 11, 2023 08:10
Subject:
Smoke [blead] v5.37.9-23-gffdab987e6 FAIL(F) linux5.18.18-200.fc36.x86_64 [Fedora Linux 37] (x86_64/1 cpu[8 cores]){blead_clang_quick_sanitize=undefined}
Message ID:
202303110810.32B8AXuC3007753@vier.local
This now errors on undefined behavior instead of warning. Smoke logs available at http://m-l.org/~perl/smoke/perl/x86_64-linux-thread-multi/blead_clang_quick_sanitize=undefined/logffdab987e62bc08e62076e591654d5d51aa01c87.log.gz
Automated smoke report for branch blead 5.37.10 patch ffdab987e62bc08e62076e591654d5d51aa01c87 v5.37.9-23-gffdab987e6
vier.local: Intel(R) Xeon(R) CPU E5-1620 0 @ 3.60GHz (GenuineIntel 4676MHz) (x86_64/1 cpu[8 cores])
on linux - 5.18.18-200.fc36.x86_64 [Fedora Linux 37]
using ccache clang version Clang 15.0.7 (Fedora 15.0.7-1.fc37)
smoketime 13 days 18 hours 30 minutes (average 3 days 10 hours 37 minutes)
Summary: FAIL(F)
O = OK F = Failure(s), extended report at the bottom
X = Failure(s) under TEST but not under harness
? = still running or test results not (yet) available
Build failures during: - = unknown or N/A
c = Configure, m = make, M = make (after miniperl), t = make test-prep
v5.37.9-23-gffdab987e6 Configuration (common) -Accflags="-g -fno-omit-frame-pointer -fno-sanitize-recover=undefined -fsanitize-blacklist=`pwd`/asan_ignore" -Aldflags="-fno-sanitize-recover=undefined" -Dcc="ccache clang"
----------- ---------------------------------------------------------
F O
O O -Duseithreads
| +--------- -DDEBUGGING
+----------- no debugging
Testsuite was run only with 'harness' and HARNESS_OPTIONS=j4
Failures: (common-args) -Accflags="-g -fno-omit-frame-pointer -fno-sanitize-recover=undefined -fsanitize-blacklist=`pwd`/asan_ignore" -Aldflags="-fno-sanitize-recover=undefined" -Dcc="ccache clang"
[default]
../cpan/DB_File/t/db-hash.t.................................FAILED
115
Non-zero exit status: 28
Bad plan. You planned 166 tests but ran 115.
../cpan/Digest/t/base.t.....................................FAILED
Non-zero exit status: 28
Bad plan. You planned 13 tests but ran 7.
../cpan/DB_File/t/db-recno.t................................FAILED
204
../cpan/Encode/t/CJKT.t.....................................FAILED
37
Non-zero exit status: 1
../cpan/Encode/t/Unicode_trailing_nul.t.....................FAILED
1
Non-zero exit status: 1
../cpan/ExtUtils-Constant/t/Constant.t......................FAILED
Non-zero exit status: 28
No plan found in TAP output
../cpan/ExtUtils-Install/t/Install.t........................FAILED
Non-zero exit status: 28
Bad plan. You planned 62 tests but ran 7.
../cpan/ExtUtils-Install/t/can_write_dir.t..................FAILED
5-12
Non-zero exit status: 8
../cpan/ExtUtils-Install/t/Installapi2.t....................FAILED
Non-zero exit status: 28
Bad plan. You planned 70 tests but ran 7.
../cpan/ExtUtils-Install/t/Installed.t......................FAILED
Non-zero exit status: 28
Bad plan. You planned 76 tests but ran 18.
../cpan/ExtUtils-Install/t/InstallWithMM.t..................FAILED
Non-zero exit status: 28
Bad plan. You planned 15 tests but ran 2.
../cpan/ExtUtils-Install/t/Packlist.t.......................FAILED
23-26, 29-31
Non-zero exit status: 7
../cpan/ExtUtils-MakeMaker/t/02-xsdynamic.t.................FAILED
Non-zero exit status: 28
No plan found in TAP output
../cpan/ExtUtils-MakeMaker/t/03-xsstatic.t..................FAILED
Non-zero exit status: 28
No plan found in TAP output
../cpan/ExtUtils-MakeMaker/t/basic.t........................FAILED
Non-zero exit status: 28
Bad plan. You planned 188 tests but ran 0.
../cpan/ExtUtils-MakeMaker/t/build_man.t....................FAILED
Non-zero exit status: 28
Bad plan. You planned 50 tests but ran 2.
../cpan/ExtUtils-MakeMaker/t/cd.t...........................FAILED
Non-zero exit status: 28
Bad plan. You planned 4 tests but ran 0.
../cpan/ExtUtils-MakeMaker/t/dir_target.t...................FAILED
Non-zero exit status: 28
Bad plan. You planned 1 tests but ran 0.
../cpan/ExtUtils-MakeMaker/t/echo.t.........................FAILED
Non-zero exit status: 28
Bad plan. You planned 18 tests but ran 0.
../cpan/ExtUtils-MakeMaker/t/FIRST_MAKEFILE.t...............FAILED
Non-zero exit status: 28
Bad plan. You planned 7 tests but ran 2.
../cpan/ExtUtils-MakeMaker/t/fixin.t........................FAILED
Non-zero exit status: 28
Bad plan. You planned 30 tests but ran 2.
../cpan/ExtUtils-MakeMaker/t/hints.t........................FAILED
Non-zero exit status: 28
Bad plan. You planned 3 tests but ran 0.
../cpan/ExtUtils-MakeMaker/t/INST.t.........................FAILED
Non-zero exit status: 28
Bad plan. You planned 26 tests but ran 2.
../cpan/ExtUtils-MakeMaker/t/INST_PREFIX.t..................FAILED
Non-zero exit status: 28
Bad plan. You planned 52 tests but ran 2.
../cpan/ExtUtils-MakeMaker/t/INSTALL_BASE.t.................FAILED
Non-zero exit status: 28
Bad plan. You planned 37 tests but ran 3.
../cpan/ExtUtils-MakeMaker/t/meta_convert.t.................FAILED
Non-zero exit status: 28
No plan found in TAP output
../cpan/ExtUtils-MakeMaker/t/metafile_data.t................FAILED
Non-zero exit status: 28
Bad plan. You planned 35 tests but ran 29.
../cpan/ExtUtils-MakeMaker/t/eu_command.t...................FAILED
10
Non-zero exit status: 28
Bad plan. You planned 40 tests but ran 15.
../cpan/ExtUtils-MakeMaker/t/min_perl_version.t.............FAILED
2
Non-zero exit status: 28
Bad plan. You planned 35 tests but ran 2.
../cpan/ExtUtils-MakeMaker/t/Mkbootstrap.t..................FAILED
2-3
Non-zero exit status: 255
Bad plan. You planned 18 tests but ran 6.
../cpan/ExtUtils-MakeMaker/t/miniperl.t.....................FAILED
Non-zero exit status: 28
../cpan/ExtUtils-MakeMaker/t/parse_abstract.t...............FAILED
1-12
Non-zero exit status: 12
../cpan/ExtUtils-MakeMaker/t/pm.t...........................FAILED
Non-zero exit status: 28
Bad plan. You planned 6 tests but ran 2.
../cpan/ExtUtils-MakeMaker/t/PL_FILES.t.....................FAILED
2
Non-zero exit status: 28
Bad plan. You planned 12 tests but ran 2.
../cpan/ExtUtils-MakeMaker/t/parse_version.t................FAILED
2, 5, 12, 15, 30, 33, 40, 43, 49, 52, 55
58, 61, 67, 74, 77, 80, 83, 110, 113, 116
119, 122, 125, 128, 131, 134, 137, 140
143, 146, 149, 152, 155, 158, 161, 164
167, 170, 173, 175
Non-zero exit status: 41
../cpan/ExtUtils-MakeMaker/t/pm_to_blib.t...................FAILED
Non-zero exit status: 28
../cpan/ExtUtils-MakeMaker/t/postamble.t....................FAILED
Non-zero exit status: 28
Bad plan. You planned 8 tests but ran 2.
../cpan/ExtUtils-MakeMaker/t/prereq.t.......................FAILED
Non-zero exit status: 28
Bad plan. You planned 21 tests but ran 2.
../cpan/ExtUtils-MakeMaker/t/prereq_print.t.................FAILED
Non-zero exit status: 28
Bad plan. You planned 11 tests but ran 2.
../cpan/ExtUtils-MakeMaker/t/problems.t.....................FAILED
2
Non-zero exit status: 28
Bad plan. You planned 5 tests but ran 2.
../cpan/ExtUtils-MakeMaker/t/recurs.t.......................FAILED
2
Non-zero exit status: 28
Bad plan. You planned 28 tests but ran 2.
../cpan/ExtUtils-MakeMaker/t/several_authors.t..............FAILED
2
Non-zero exit status: 28
Bad plan. You planned 19 tests but ran 2.
../cpan/ExtUtils-MakeMaker/t/unicode.t......................FAILED
2
Non-zero exit status: 28
Bad plan. You planned 8 tests but ran 2.
../cpan/ExtUtils-MakeMaker/t/vstrings.t.....................FAILED
Non-zero exit status: 28
No plan found in TAP output
../cpan/ExtUtils-MakeMaker/t/VERSION_FROM.t.................FAILED
Non-zero exit status: 28
Bad plan. You planned 1 tests but ran 0.
../cpan/ExtUtils-MakeMaker/t/WriteEmptyMakefile.t...........FAILED
Non-zero exit status: 28
Bad plan. You planned 5 tests but ran 0.
../cpan/ExtUtils-MakeMaker/t/writemakefile_args.t...........FAILED
Non-zero exit status: 28
Bad plan. You planned 43 tests but ran 2.
../cpan/ExtUtils-Manifest/t/Manifest.t......................FAILED
2-3, 5, 7-8, 12, 14-20, 22, 24-25, 27
Non-zero exit status: 28
Bad plan. You planned 98 tests but ran 27.
../cpan/File-Path/t/Path.t..................................FAILED
Non-zero exit status: 28
Bad plan. You planned 167 tests but ran 3.
../cpan/File-Temp/t/cmp.t...................................FAILED
Non-zero exit status: 28
Bad plan. You planned 19 tests but ran 10.
../cpan/File-Path/t/taint.t.................................FAILED
Non-zero exit status: 28
Bad plan. You planned 6 tests but ran 2.
../cpan/File-Temp/t/mktemp.t................................FAILED
Non-zero exit status: 28
Bad plan. You planned 9 tests but ran 7.
../cpan/File-Temp/t/object.t................................FAILED
Non-zero exit status: 28
Bad plan. You planned 35 tests but ran 7.
../cpan/File-Temp/t/posix.t.................................FAILED
Non-zero exit status: 28
Bad plan. You planned 7 tests but ran 5.
../cpan/File-Temp/t/rmtree.t................................FAILED
Non-zero exit status: 28
Bad plan. You planned 1 tests but ran 0.
../cpan/File-Temp/t/tempfile.t..............................FAILED
Non-zero exit status: 28
Bad plan. You planned 30 tests but ran 5.
../cpan/Filter-Util-Call/t/call.t...........................FAILED
Non-zero exit status: 28
Bad plan. You planned 34 tests but ran 0.
../cpan/Filter-Util-Call/t/rt_54452-rebless.t...............FAILED
Non-zero exit status: 28
No plan found in TAP output
../cpan/HTTP-Tiny/t/020_headers.t...........................FAILED
Non-zero exit status: 28
../cpan/HTTP-Tiny/t/030_response.t..........................FAILED
Non-zero exit status: 28
../cpan/HTTP-Tiny/t/040_content.t...........................FAILED
Non-zero exit status: 28
../cpan/HTTP-Tiny/t/050_chunked_body.t......................FAILED
Non-zero exit status: 28
../cpan/HTTP-Tiny/t/100_get.t...............................FAILED
Non-zero exit status: 28
No plan found in TAP output
../lib/AnyDBM_File.t........................................FAILED
1-2, 4, 9
Non-zero exit status: 4
../lib/DBM_Filter/t/01error.t...............................FAILED
Non-zero exit status: 28
No plan found in TAP output
../lib/DBM_Filter/t/02core.t................................FAILED
Non-zero exit status: 28
No plan found in TAP output
../cpan/DB_File/t/db-btree.t................................FAILED
No plan found in TAP output
MANIFEST did not declare '.mailmap'
(See log because mailing list size limit is too small.)
Non-Fatal messages(gcc):
--
Report by Test::Smoke v1.72 running on perl 5.36.0
(Reporter v0.053 / Smoker v0.046)
-
Smoke [blead] v5.37.9-23-gffdab987e6 FAIL(F) linux5.18.18-200.fc36.x86_64 [Fedora Linux 37] (x86_64/1 cpu[8 cores]){blead_clang_quick_sanitize=undefined}
by George Greer